Ask coding questions

← Back to all posts
Why I can't run quick.db with my bot?
HassanHaidar (1)

I have tried a lot of dev websites and repl.it was always my favorite, but a while ago I chose to move to CodeSandBox cause I couldn't add quick.db to my repl. But c.s.b wasn't the best at all. I couldn't update my node there and that made me unable to make embeds. So now I came back and I want to find a solution. PLEASE HELP ME GUYS!!

Oh and I always get this error:
`Error: Cannot find module 'better-sqlite3'
Require stack:

  • /home/runner/Empyrean-Economy/node_modules/quick.db/src/index.js
  • /home/runner/Empyrean-Economy/node_modules/quick.db/index.js
  • /home/runner/Empyrean-Economy/index.js
    at Function.Module._resolveFilename (internal/modules/cjs/loader.js:815:15)
    at Function.Module._load (internal/modules/cjs/loader.js:667:27)
    at Module.require (internal/modules/cjs/loader.js:887:19)
    at require (internal/modules/cjs/helpers.js:74:18)
    at Object.<anonymous> (/home/runner/Empyrean-Economy/node_modules/quick.db/src/index.js:2:18)
    at Module._compile (internal/modules/cjs/loader.js:999:30)
    at Object.Module._extensions..js (internal/modules/cjs/loader.js:1027:10)
    at Module.load (internal/modules/cjs/loader.js:863:32)
    at Function.Module._load (internal/modules/cjs/loader.js:708:14)
    at Module.require (internal/modules/cjs/loader.js:887:19)`

And when I try to install better-sqlite3 I get this error:
`> [email protected] install /home/runner/Empyrean-Economy/node_modules/better-sqlite3

prebuild-install || npm run build-release

prebuild-install WARN install /lib/x86_64-linux-gnu/libm.so.6: version `GLIBC_2.29' not found (required by /home/runner/Empyrean-Economy/node_modules/better-sqlite3/build/Release/better_sqlite3.node)

[email protected] build-release /home/runner/Empyrean-Economy/node_modules/better-sqlite3
node-gyp rebuild --release

make: Entering directory '/home/runner/Empyrean-Economy/node_modules/better-sqlite3/build'
TOUCH b857c92884e9598d609f6be182a2595df7a8e00f.intermediate
ACTION deps_sqlite3_gyp_locate_sqlite3_target_extract_sqlite3 b857c92884e9598d609f6be182a2595df7a8e00f.intermediate
TOUCH Release/obj.target/deps/locate_sqlite3.stamp
CC(target) Release/obj.target/sqlite3/gen/sqlite3/sqlite3.o
cc: internal compiler error: Killed (program cc1)
Please submit a full bug report,
with preprocessed source if appropriate.
See file:///usr/share/doc/gcc-6/README.Bugs for instructions.
deps/sqlite3.target.mk:199: recipe for target 'Release/obj.target/sqlite3/gen/sqlite3/sqlite3.o' failed
make: *** [Release/obj.target/sqlite3/gen/sqlite3/sqlite3.o] Error 4
rm b857c92884e9598d609f6be182a2595df7a8e00f.intermediate
make: Leaving directory '/home/runner/Empyrean-Economy/node_modules/better-sqlite3/build'
gyp ERR! build error
gyp ERR! stack Error: make failed with exit code: 2
gyp ERR! stack at ChildProcess.onExit (/usr/local/lib/node_modules/npm/node_modules/node-gyp/lib/build.js:194:23)
gyp ERR! stack at ChildProcess.emit (events.js:314:20)
gyp ERR! stack at Process.ChildProcess._handle.onexit (internal/child_process.js:276:12)
gyp ERR! System Linux 5.4.0-1042-gcp
gyp ERR! command "/usr/local/bin/node" "/usr/local/lib/node_modules/npm/node_modules/node-gyp/bin/node-gyp.js" "rebuild" "--release"
gyp ERR! cwd /home/runner/Empyrean-Economy/node_modules/better-sqlite3
gyp ERR! node -v v12.22.1
gyp ERR! node-gyp -v v5.1.0
gyp ERR! not ok
npm ERR! code ELIFECYCLE
npm ERR! errno 1
npm ERR! [email protected] build-release: node-gyp rebuild --release
npm ERR! Exit status 1
npm ERR!
npm ERR! Failed at the [email protected] build-release script.
npm ERR! This is probably not a problem with npm. There is likely additional logging output above.
npm WARN Local package.json exists, but node_modules missing, did you mean to install?

npm ERR! A complete log of this run can be found in:
npm ERR! /home/runner/.npm/_logs/2021-05-08T08_13_44_898Z-debug.log
npm WARN [email protected] No description
npm WARN [email protected] No repository field.

npm ERR! code ELIFECYCLE
npm ERR! errno 1
npm ERR! [email protected] install: prebuild-install || npm run build-release
npm ERR! Exit status 1
npm ERR!
npm ERR! Failed at the [email protected] install script.
npm ERR! This is probably not a problem with npm. There is likely additional logging output above.

npm ERR! A complete log of this run can be found in:
npm ERR! /home/runner/.npm/_logs/2021-05-08T08_13_46_290Z-debug.log
exit status 1

Repl.it: Package operation failed.
`